Xcode Linker Command Failed With Exit Code 1

xcode 버그, Linker command failed with exit code 1 이런 버그

xcode 버그, Linker command failed with exit code 1 이런 버그

Read more
Fix XCode 5 1 Build/Linker error in PhoneGap 3 4

Fix XCode 5 1 Build/Linker error in PhoneGap 3 4

Read more
C Compiler, Part 10: Global Variables

C Compiler, Part 10: Global Variables

Read more
Xcode Framework not found FileProvider for architecture

Xcode Framework not found FileProvider for architecture

Read more
Compile error: Apple Mach-O Linker (Id) Error Linker command

Compile error: Apple Mach-O Linker (Id) Error Linker command

Read more
Linker command failed with exit code 1 - iOS - 카카오 데브톡

Linker command failed with exit code 1 - iOS - 카카오 데브톡

Read more
The Guide to Fixing Xcode Errors and Crashes

The Guide to Fixing Xcode Errors and Crashes

Read more
clang: error: linker command failed with exit code 1 (use -v

clang: error: linker command failed with exit code 1 (use -v

Read more
Trouble Building Ionic 1 iOS App - ionic-v1 - Ionic Forum

Trouble Building Ionic 1 iOS App - ionic-v1 - Ionic Forum

Read more
clang👎 linker command failed with exit code 1 (use -v to

clang👎 linker command failed with exit code 1 (use -v to

Read more
linker command failed with exit code 1 (错误总结)_慕课手记

linker command failed with exit code 1 (错误总结)_慕课手记

Read more
Xcode 10 0: Linker command failed with exit code 1 (use -v

Xcode 10 0: Linker command failed with exit code 1 (use -v

Read more
Google Sign-In SDK for iOS 導入時に出た linker command

Google Sign-In SDK for iOS 導入時に出た linker command

Read more
linker command failed with exit code 1 when adding

linker command failed with exit code 1 when adding

Read more
Xcode -

Xcode - "Linker command failed with exit code 1 after

Read more
Let's Build Chuck Norris! - Part 8: Using C++ in an iOS

Let's Build Chuck Norris! - Part 8: Using C++ in an iOS

Read more
SOLVED] Fix Apple Mach-O Linker Error in Simple Steps

SOLVED] Fix Apple Mach-O Linker Error in Simple Steps

Read more
How to install CocoaPods & intro of cocoa pods

How to install CocoaPods & intro of cocoa pods

Read more
Lets learn mobile automation testing - calabash: Calabash

Lets learn mobile automation testing - calabash: Calabash

Read more
clang: error: linker command failed with exit code 1 (use -v

clang: error: linker command failed with exit code 1 (use -v

Read more
Xcode 10, OF 0 10 1 - will not build for simulators - iOS

Xcode 10, OF 0 10 1 - will not build for simulators - iOS

Read more
Migrating Perfect project to Swift 4 - By

Migrating Perfect project to Swift 4 - By

Read more
Apple Mach-O Linker (ld) Error の詳細 - Qiita

Apple Mach-O Linker (ld) Error の詳細 - Qiita

Read more
clang: error: linker command failed with exit code 1 (use -v

clang: error: linker command failed with exit code 1 (use -v

Read more
Creating and Distributing an iOS Binary Framework | Instabug

Creating and Distributing an iOS Binary Framework | Instabug

Read more
Linker command failed with exit code 1 解決法 - tkmium-note

Linker command failed with exit code 1 解決法 - tkmium-note

Read more
Directories and library not found in Xcode

Directories and library not found in Xcode

Read more
ld: framework not found ReactiveCocoa clang: error: linker

ld: framework not found ReactiveCocoa clang: error: linker

Read more
Developers - Can't build release iOS version - error: linker

Developers - Can't build release iOS version - error: linker

Read more
What is the Error

What is the Error "linker command failed with exit code 1

Read more
解决XCode编译异常clang: error: linker command failed with

解决XCode编译异常clang: error: linker command failed with

Read more
Xcode8] cocoapod 업데이트 후 linker command failed with exit

Xcode8] cocoapod 업데이트 후 linker command failed with exit

Read more
Just updated Xcode to 7 and attempting to build app in iOS9

Just updated Xcode to 7 and attempting to build app in iOS9

Read more
Xcode Build Solution - Ultimate Racing (And others)

Xcode Build Solution - Ultimate Racing (And others)

Read more
linker command failed with exit code 1 (use -v to see

linker command failed with exit code 1 (use -v to see

Read more
ObjC Tutorial, Xcode: “ld: symbol(s) not found for

ObjC Tutorial, Xcode: “ld: symbol(s) not found for

Read more
iOS Swift Newbie Gotchas Reminders #1 — clang: error: linker

iOS Swift Newbie Gotchas Reminders #1 — clang: error: linker

Read more
Fix for

Fix for "undefined symbols" when building in Xcode 6 - x

Read more
Code Signing Tasks

Code Signing Tasks

Read more
Cordova camera plugin doesn't build with xcode 6 1 1 - Ionic

Cordova camera plugin doesn't build with xcode 6 1 1 - Ionic

Read more
How do I get rid of the llua lib linking error when I try to

How do I get rid of the llua lib linking error when I try to

Read more
Clang Error In Xcode 10

Clang Error In Xcode 10

Read more
Unity】Xcodeでビルドするときに「linker command failed with

Unity】Xcodeでビルドするときに「linker command failed with

Read more
Linker command failed with exit code 1 (use -v for more

Linker command failed with exit code 1 (use -v for more

Read more
An Introduction to Creating and Distributing Embedded

An Introduction to Creating and Distributing Embedded

Read more
Directories and library not found in Xcode

Directories and library not found in Xcode

Read more
ios - Library not found for -llib  (clang: error: linker

ios - Library not found for -llib (clang: error: linker

Read more
Objc-class-ref error in couchbase lite in iOS cocoapods

Objc-class-ref error in couchbase lite in iOS cocoapods

Read more
iOS pod出现linker command failed with exit code 1问题- JPush

iOS pod出现linker command failed with exit code 1问题- JPush

Read more
chaoa888 ( chaoa )

chaoa888 ( chaoa )

Read more
How to Troubleshoot Your Swift and Objective-C Framework

How to Troubleshoot Your Swift and Objective-C Framework

Read more
iOS and Android setup on MacOS - Build Failed when trying to

iOS and Android setup on MacOS - Build Failed when trying to

Read more
Cocoapods remove duplicate symbols for architecture i386 error

Cocoapods remove duplicate symbols for architecture i386 error

Read more
Xcode7报错:Xcode setting ENABLE_BITCODE - 爱程序网

Xcode7报错:Xcode setting ENABLE_BITCODE - 爱程序网

Read more
Installing opencv - Apple Community

Installing opencv - Apple Community

Read more
Problems with updating to version 10 of Xcode ios 12

Problems with updating to version 10 of Xcode ios 12

Read more
Linker command failed with exit code 1 xcode | Linker

Linker command failed with exit code 1 xcode | Linker

Read more
UP lol: 升級到xcode4 5後facebook sdk有遇到問題

UP lol: 升級到xcode4 5後facebook sdk有遇到問題

Read more
Getting error

Getting error "linker command failed with exit code 1 (use

Read more
xcodebuild - exit code 65 | CircleCI

xcodebuild - exit code 65 | CircleCI

Read more
Archive시 오류가 납니다 (All object files and libraries for

Archive시 오류가 납니다 (All object files and libraries for

Read more
Ionic / Cordova] Problem gelöst: duplicate symbols for

Ionic / Cordova] Problem gelöst: duplicate symbols for

Read more
An Introduction to Creating and Distributing Embedded

An Introduction to Creating and Distributing Embedded

Read more
Send Push Notifications to iOS Devices using Xcode 8 and Swift 3

Send Push Notifications to iOS Devices using Xcode 8 and Swift 3

Read more
linker command failed with exit code 1 (use -v to see

linker command failed with exit code 1 (use -v to see

Read more
Making Audio Plugins Part 2: Setting up WDL-OL - Martin

Making Audio Plugins Part 2: Setting up WDL-OL - Martin

Read more
ld: can't open -sectcreate file: Library/Developer/Xcode

ld: can't open -sectcreate file: Library/Developer/Xcode

Read more
Xcode Test Target - Linker errors, missing headers - MacOSX

Xcode Test Target - Linker errors, missing headers - MacOSX

Read more
Installing opencv - Apple Community

Installing opencv - Apple Community

Read more
When Things Aren't that Simple: Our Experience with Google

When Things Aren't that Simple: Our Experience with Google

Read more
Can't build Lazy Foo's Source for Lesson 1 in XCode - SDL

Can't build Lazy Foo's Source for Lesson 1 in XCode - SDL

Read more
PureBasic Forum • View topic - PB x86 compiler doesn't work

PureBasic Forum • View topic - PB x86 compiler doesn't work

Read more
How to Fix Apple Mach-O Linker Error- Xcode? +1-800-763-4027

How to Fix Apple Mach-O Linker Error- Xcode? +1-800-763-4027

Read more
Xcode真機執行報錯linker command failed with exit code 1 (use

Xcode真機執行報錯linker command failed with exit code 1 (use

Read more
The Guide to Fixing Xcode Errors and Crashes

The Guide to Fixing Xcode Errors and Crashes

Read more
Linker command failed with exit code 1 (use -v to see

Linker command failed with exit code 1 (use -v to see

Read more
iOS开发-Xcode编译常见错误解决:linker command failed with

iOS开发-Xcode编译常见错误解决:linker command failed with

Read more
eZeeNow com :: How to use single responsibility with

eZeeNow com :: How to use single responsibility with

Read more
ARKit and Unity - blog

ARKit and Unity - blog

Read more
App Center Build Frequently Asked Questions - Visual Studio

App Center Build Frequently Asked Questions - Visual Studio

Read more
在mac上用Xcode寫程式, run的時候總是失敗, 顯示clang: error

在mac上用Xcode寫程式, run的時候總是失敗, 顯示clang: error

Read more
xcode 關於遇到linker command failed with exit code 1 (use -v

xcode 關於遇到linker command failed with exit code 1 (use -v

Read more
Server | ANDREW TRICE

Server | ANDREW TRICE

Read more
エラー2] Apple Mach-O Linker command failed with exit code 1

エラー2] Apple Mach-O Linker command failed with exit code 1

Read more
Me and Mark Publishing Blog | » Linker command failed with

Me and Mark Publishing Blog | » Linker command failed with

Read more
framework not found Reachability / linker command failed

framework not found Reachability / linker command failed

Read more
iOS报错:linker command failed with exit code 1 (use -v to

iOS报错:linker command failed with exit code 1 (use -v to

Read more
Creating and Distributing an iOS Binary Framework | Instabug

Creating and Distributing an iOS Binary Framework | Instabug

Read more
Xcode c++ and Cplex - Mathematical Programming - General Forum

Xcode c++ and Cplex - Mathematical Programming - General Forum

Read more
xcode 버그, Linker command failed with exit code 1 이런 버그

xcode 버그, Linker command failed with exit code 1 이런 버그

Read more
Getting error

Getting error "linker command failed with exit code 1 (use

Read more
Xcodeでのエラーについて - C・C++・C# 解決済み| 【OKWAVE】

Xcodeでのエラーについて - C・C++・C# 解決済み| 【OKWAVE】

Read more
Apple Mach-O Linker Error - When Building iOS Samples

Apple Mach-O Linker Error - When Building iOS Samples

Read more
iOS之clang: error: linker command failed with exit code 1

iOS之clang: error: linker command failed with exit code 1

Read more
Unity - Manual: Troubleshooting on iOS devices

Unity - Manual: Troubleshooting on iOS devices

Read more
ARKit and Unity - blog

ARKit and Unity - blog

Read more
Fix iOS 6 SDK Linker Error - Ash Furrow

Fix iOS 6 SDK Linker Error - Ash Furrow

Read more
SOLVED] Error when building Meteor App for iOS using Cordova

SOLVED] Error when building Meteor App for iOS using Cordova

Read more
clang:-1: linker command failed with exit code 1 (use -v to

clang:-1: linker command failed with exit code 1 (use -v to

Read more
Cocos2dx 3 0 and xCode 6 (IOS 8) - cocos2d-x - Cocos Forums

Cocos2dx 3 0 and xCode 6 (IOS 8) - cocos2d-x - Cocos Forums

Read more